kite-n
type: LexicalEntry
canonical form: kite
sense: 13403479-n
part of speech: noun

13403479-n
type: LexicalConcept
in scheme: en-word.net
definition: a bank check drawn on insufficient funds at another bank in order to take advantage of the float
ili: i107044
lexfile: noun.possession
part of speech: noun
hypernym: 13402907-n