treasure-n
type: LexicalEntry
canonical form: treasure
sense: 13391621-n
part of speech: noun

13391621-n
type: LexicalConcept
in scheme: en-word.net
definition: any possession that is highly valued by its owner
example: the children returned from the seashore with their shells and other treasures
ili: i106973
lexfile: noun.possession
part of speech: noun
hypernym: 00032912-n