provision-n
type: LexicalEntry
canonical form: provision
sense: 13388621-n
part of speech: noun

13388621-n
type: LexicalConcept
in scheme: en-word.net
definition: a store or supply of something (especially of food or clothing or arms)
ili: i106955
lexfile: noun.possession
part of speech: noun
hypernym: 13388243-n