fund-n
type: LexicalEntry
canonical form: fund
sense: 13379722-n
part of speech: noun

monetary fund-n
type: LexicalEntry
canonical form: monetary fund
sense: 13379722-n
part of speech: noun

13379722-n
type: LexicalConcept
in scheme: en-word.net
definition: a reserve of money set aside for some purpose
ili: i106908
lexfile: noun.possession
part of speech: noun
hypernym: 13405730-n