guarantee-n
type: LexicalEntry
canonical form: guarantee
sense: 13374019-n
part of speech: noun

guaranty-n
type: LexicalEntry
canonical form: guaranty
sense: 13374019-n
part of speech: noun

13374019-n
type: LexicalConcept
in scheme: en-word.net
definition: a collateral agreement to answer for the debt of another in case that person defaults
ili: i106876
lexfile: noun.possession
part of speech: noun
hypernym: 13373880-n