reversion-n
type: LexicalEntry
canonical form: reversion
sense: 13362365-n
part of speech: noun

13362365-n
type: LexicalConcept
in scheme: en-word.net
definition: (law) an interest in an estate that reverts to the grantor (or their heirs) at the end of some period (e.g., the death of the grantee)
ili: i106816
lexfile: noun.possession
part of speech: noun
domain topic: 08458195-n
hypernym: 13307824-n