figure-n
type: LexicalEntry
canonical form: figure
sense: 13352649-n
part of speech: noun

13352649-n
type: LexicalConcept
in scheme: en-word.net
definition: an amount of money expressed numerically
example: a figure of $17 was suggested
ili: i106762
lexfile: noun.possession
part of speech: noun
hypernym: 13352213-n