rate-n
type: LexicalEntry
canonical form: rate
sense: 13346032-n
part of speech: noun

charge per unit-n
type: LexicalEntry
canonical form: charge per unit
sense: 13346032-n
part of speech: noun

13346032-n
type: LexicalConcept
in scheme: en-word.net
definition: amount of a charge or payment relative to some basis
example: a 10-minute phone call at that rate would cost $5
ili: i106728
lexfile: noun.possession
part of speech: noun
hypernym: 13327892-n