quid pro quo-n
type: LexicalEntry
canonical form: quid pro quo
sense: 13344482-n
part of speech: noun

quid-n
type: LexicalEntry
canonical form: quid
sense: 13344482-n
part of speech: noun

13344482-n
type: LexicalConcept
in scheme: en-word.net
definition: something for something; that which a party receives (or is promised) in return for something they do or give or promise
ili: i106716
lexfile: noun.possession
part of speech: noun
hypernym: 13344335-n