commission-n
type: LexicalEntry
canonical form: commission
sense: 13341882-n
part of speech: noun

13341882-n
type: LexicalConcept
in scheme: en-word.net
definition: a fee for services rendered based on a percentage of an amount received or collected or agreed to be paid (as distinguished from a salary)
example: he works on commission
ili: i106699
lexfile: noun.possession
part of speech: noun
hypernym: 13341190-n