installment-n
type: LexicalEntry
canonical form: installment
sense: 13322737-n
part of speech: noun

13322737-n
type: LexicalConcept
in scheme: en-word.net
definition: a payment of part of a debt; usually paid at regular intervals
ili: i106580
lexfile: noun.possession
part of speech: noun
hypernym: 13299398-n