residual-n
type: LexicalEntry
canonical form: residual
sense: 13314012-n
part of speech: noun

13314012-n
type: LexicalConcept
in scheme: en-word.net
definition: (often plural) a payment that is made to a performer or writer or director of a television show or commercial that is paid for every repeat showing
example: he could retire on his residuals
ili: i106526
lexfile: noun.possession
part of speech: noun
exemplifies: 06306016-n
hypernym: 13299398-n