allotment-n
type: LexicalEntry
canonical form: allotment
sense: 13310490-n
part of speech: noun

allocation-n
type: LexicalEntry
canonical form: allocation
sense: 13310490-n
part of speech: noun

13310490-n
type: LexicalConcept
in scheme: en-word.net
definition: a share set aside for a specific purpose
ili: i106508
lexfile: noun.possession
part of speech: noun
hypernym: 13306199-n