fellowship-n
type: LexicalEntry
canonical form: fellowship
sense: 13287371-n
part of speech: noun

13287371-n
type: LexicalConcept
in scheme: en-word.net
definition: money granted (by a university or foundation or other agency) for advanced study or research
ili: i106369
lexfile: noun.possession
part of speech: noun
hypernym: 13286803-n
hypernym: 13289169-n