grant-n
type: LexicalEntry
canonical form: grant
sense: 13275136-n
part of speech: noun

assignment-n
type: LexicalEntry
canonical form: assignment
sense: 13275136-n
part of speech: noun

13275136-n
type: LexicalConcept
in scheme: en-word.net
definition: (law) a transfer of property by deed of conveyance
ili: i106303
lexfile: noun.possession
part of speech: noun
domain topic: 08458195-n
hypernym: 13273872-n