sprout-n
type: LexicalEntry
canonical form: sprout
sense: 13185481-n
part of speech: noun

13185481-n
type: LexicalConcept
in scheme: en-word.net
definition: any new growth of a plant such as a new branch or a bud
ili: i105849
lexfile: noun.plant
part of speech: noun
hypernym: 13108385-n