pinna-n
type: LexicalEntry
canonical form: pinna
sense: 13175183-n
part of speech: noun

pinnule-n
type: LexicalEntry
canonical form: pinnule
sense: 13175183-n
part of speech: noun

13175183-n
type: LexicalConcept
in scheme: en-word.net
definition: division of a usually pinnately divided leaf
ili: i105773
lexfile: noun.plant
part of speech: noun
hypernym: 13174872-n