rachis-n
type: LexicalEntry
canonical form: rachis
sense: 13149735-n
part of speech: noun

13149735-n
type: LexicalConcept
in scheme: en-word.net
definition: axis of a compound leaf or compound inflorescence
ili: i105639
lexfile: noun.plant
part of speech: noun
hypernym: 13149530-n