annulus-n
type: LexicalEntry
canonical form: annulus
sense: 13116107-n
part of speech: noun

skirt-n
type: LexicalEntry
canonical form: skirt
sense: 13116107-n
part of speech: noun

13116107-n
type: LexicalConcept
in scheme: en-word.net
definition: (Fungi) a remnant of the partial veil that in mature mushrooms surrounds the stem like a collar
ili: i105532
lexfile: noun.plant
part of speech: noun
domain topic: 13013224-n
hypernym: 13107668-n