carrot-n
type: LexicalEntry
canonical form: carrot
sense: 12958438-n
part of speech: noun

12958438-n
type: LexicalConcept
in scheme: en-word.net
definition: deep orange edible root of the cultivated carrot plant
ili: i104745
lexfile: noun.plant
part of speech: noun
hypernym: 13145876-n