palm-n
type: LexicalEntry
canonical form: palm
sense: 12602979-n
part of speech: noun

palm tree-n
type: LexicalEntry
canonical form: palm tree
sense: 12602979-n
part of speech: noun

12602979-n
type: LexicalConcept
in scheme: en-word.net
definition: any plant of the family Palmae having an unbranched trunk crowned by large pinnate or palmate leaves
ili: i103010
lexfile: noun.plant
part of speech: noun
hypernym: 13124818-n