achene-n
type: LexicalEntry
canonical form: achene
sense: 12056536-n
part of speech: noun

12056536-n
type: LexicalConcept
in scheme: en-word.net
definition: small dry indehiscent fruit with the seed distinct from the fruit wall
ili: i100446
lexfile: noun.plant
part of speech: noun
hypernym: 13155706-n