shell-n
type: LexicalEntry
canonical form: shell
sense: 11704025-n
part of speech: noun

11704025-n
type: LexicalConcept
in scheme: en-word.net
definition: the hard usually fibrous outer layer of some fruits especially nuts
ili: i98738
lexfile: noun.plant
part of speech: noun
hypernym: 13160695-n