stigma-n
type: LexicalEntry
canonical form: stigma
sense: 11698054-n
part of speech: noun

11698054-n
type: LexicalConcept
in scheme: en-word.net
definition: the apical end of the style where deposited pollen enters the pistil
ili: i98699
lexfile: noun.plant
part of speech: noun
hypernym: 11696293-n