escape-n
type: LexicalEntry
canonical form: escape
sense: 11573870-n
part of speech: noun

11573870-n
type: LexicalConcept
in scheme: en-word.net
definition: a plant originally cultivated but now growing wild
ili: i98304
lexfile: noun.plant
part of speech: noun
hypernym: 00017402-n