fog-n
type: LexicalEntry
canonical form: fog
sense: 11478731-n
part of speech: noun

11478731-n
type: LexicalConcept
in scheme: en-word.net
definition: droplets of water vapor suspended in the air near the ground
ili: i97801
lexfile: noun.phenomenon
part of speech: noun
hypernym: 11442711-n