repulsion-n
type: LexicalEntry
canonical form: repulsion
sense: 11447028-n
part of speech: noun

repulsive force-n
type: LexicalEntry
canonical form: repulsive force
sense: 11447028-n
part of speech: noun

11447028-n
type: LexicalConcept
in scheme: en-word.net
definition: the force by which bodies repel one another
ili: i97632
lexfile: noun.phenomenon
part of speech: noun
attribute: https://en-word.net/synset/00171417-a
hypernym: 11479041-n