product-n
type: LexicalEntry
canonical form: product
sense: 11435956-n
part of speech: noun

11435956-n
type: LexicalConcept
in scheme: en-word.net
definition: a consequence of someone's efforts or of a particular set of circumstances
example: skill is the product of hours of practice
example: his reaction was the product of hunger and fatigue
ili: i97584
lexfile: noun.phenomenon
part of speech: noun
hypernym: 11430739-n