Zeppelin-n
type: LexicalEntry
canonical form: Zeppelin
sense: 11426137-n
part of speech: noun

Count Ferdinand von Zeppelin-n
type: LexicalEntry
canonical form: Count Ferdinand von Zeppelin
sense: 11426137-n
part of speech: noun

11426137-n
type: LexicalConcept
in scheme: en-word.net
definition: German inventor who designed and built the first rigid motorized dirigible (1838-1917)
ili: i97534
lexfile: noun.person
part of speech: noun
instance hypernym: 10234307-n