Zephaniah-n
type: LexicalEntry
canonical form: Zephaniah
sense: 11426019-n
part of speech: noun

Sophonias-n
type: LexicalEntry
canonical form: Sophonias
sense: 11426019-n
part of speech: noun

11426019-n
type: LexicalConcept
in scheme: en-word.net
definition: a Hebrew minor prophet of the late 7th century BC
ili: i97533
lexfile: noun.person
part of speech: noun
instance hypernym: 10503475-n