Sukarno-n
type: LexicalEntry
canonical form: Sukarno
sense: 11343844-n
part of speech: noun

Achmad Sukarno-n
type: LexicalEntry
canonical form: Achmad Sukarno
sense: 11343844-n
part of speech: noun

11343844-n
type: LexicalConcept
in scheme: en-word.net
definition: Indonesian statesman who obtained the independence of Indonesia from the Netherlands in 1949 and served as president until ousted by Suharto in a coup d'etat (1901-1970)
ili: i97056
lexfile: noun.person
part of speech: noun
instance hypernym: 10669601-n