Styron-n
type: LexicalEntry
canonical form: Styron
sense: 11343311-n
part of speech: noun

William Styron-n
type: LexicalEntry
canonical form: William Styron
sense: 11343311-n
part of speech: noun

11343311-n
type: LexicalConcept
in scheme: en-word.net
definition: United States writer best known for his novels (born in 1925)
ili: i97052
lexfile: noun.person
part of speech: noun
instance hypernym: 10813654-n