Rousseau-n
type: LexicalEntry
canonical form: Rousseau
sense: 11292679-n
part of speech: noun

Jean-Jacques Rousseau-n
type: LexicalEntry
canonical form: Jean-Jacques Rousseau
sense: 11292679-n
part of speech: noun

11292679-n
type: LexicalConcept
in scheme: en-word.net
definition: French philosopher and writer born in Switzerland; believed that the natural goodness of man was warped by society; ideas influenced the French Revolution (1712-1778)
ili: i96766
lexfile: noun.person
part of speech: noun
instance hypernym: 10813654-n
instance hypernym: 10443334-n