Pulitzer-n
type: LexicalEntry
canonical form: Pulitzer
sense: 11268416-n
part of speech: noun

Joseph Pulitzer-n
type: LexicalEntry
canonical form: Joseph Pulitzer
sense: 11268416-n
part of speech: noun

11268416-n
type: LexicalConcept
in scheme: en-word.net
definition: United States newspaper publisher (born in Hungary) who established the Pulitzer prizes (1847-1911)
ili: i96640
lexfile: noun.person
part of speech: noun
instance hypernym: 10511160-n