Lennon-n
type: LexicalEntry
canonical form: Lennon
sense: 11146773-n
part of speech: noun

John Lennon-n
type: LexicalEntry
canonical form: John Lennon
sense: 11146773-n
part of speech: noun

11146773-n
type: LexicalConcept
in scheme: en-word.net
definition: English rock star and guitarist and songwriter who with Paul McCartney wrote most of the music for the Beatles (1940-1980)
ili: i95942
lexfile: noun.person
part of speech: noun
instance hypernym: 10555973-n
instance hypernym: 10643902-n