Landsteiner-n
type: LexicalEntry
canonical form: Landsteiner
sense: 11136107-n
part of speech: noun

Karl Landsteiner-n
type: LexicalEntry
canonical form: Karl Landsteiner
sense: 11136107-n
part of speech: noun

11136107-n
type: LexicalConcept
in scheme: en-word.net
definition: United States pathologist (born in Austria) who discovered human blood groups (1868-1943)
ili: i95886
lexfile: noun.person
part of speech: noun
instance hypernym: 10030728-n