Jonah-n
type: LexicalEntry
canonical form: Jonah
sense: 11109858-n
part of speech: noun

11109858-n
type: LexicalConcept
in scheme: en-word.net
definition: (Old Testament) Jonah did not wish to become a prophet so God caused a great storm to throw him overboard from a ship; he was saved by being swallowed by a whale that vomited him out onto dry land
ili: i95743
lexfile: noun.person
part of speech: noun
domain topic: 06461405-n
instance hypernym: 10503475-n