Jevons-n
type: LexicalEntry
canonical form: Jevons
sense: 11104190-n
part of speech: noun

William Stanley Jevons-n
type: LexicalEntry
canonical form: William Stanley Jevons
sense: 11104190-n
part of speech: noun

11104190-n
type: LexicalConcept
in scheme: en-word.net
definition: English economist and logician who contributed to the development of the theory of marginal utility (1835-1882)
ili: i95715
lexfile: noun.person
part of speech: noun
instance hypernym: 10063451-n
instance hypernym: 10289482-n