Isaac-n
type: LexicalEntry
canonical form: Isaac
sense: 11093576-n
part of speech: noun

11093576-n
type: LexicalConcept
in scheme: en-word.net
definition: (Old Testament) the second patriarch; son of Abraham and Sarah who was offered by Abraham as a sacrifice to God; father of Jacob and Esau
ili: i95662
lexfile: noun.person
part of speech: noun
domain topic: 06461405-n
instance hypernym: 10426136-n