Ho Chi Minh-n
type: LexicalEntry
canonical form: Ho Chi Minh
sense: 11073339-n
part of speech: noun

Nguyen Tat Thanh-n
type: LexicalEntry
canonical form: Nguyen Tat Thanh
sense: 11073339-n
part of speech: noun

11073339-n
type: LexicalConcept
in scheme: en-word.net
definition: Vietnamese communist statesman who fought the Japanese in World War II and the French until 1954 and South Vietnam until 1975 (1890-1969)
ili: i95547
lexfile: noun.person
part of speech: noun
instance hypernym: 10669601-n