Fox-n
type: LexicalEntry
canonical form: Fox
sense: 10996993-n
part of speech: noun

Charles James Fox-n
type: LexicalEntry
canonical form: Charles James Fox
sense: 10996993-n
part of speech: noun

10996993-n
type: LexicalConcept
in scheme: en-word.net
definition: English statesman who supported American independence and the French Revolution (1749-1806)
ili: i95142
lexfile: noun.person
part of speech: noun
instance hypernym: 10669601-n