Euripides-n
type: LexicalEntry
canonical form: Euripides
sense: 10982704-n
part of speech: noun

10982704-n
type: LexicalConcept
in scheme: en-word.net
definition: one of the greatest tragic dramatists of ancient Greece (480-406 BC)
ili: i95061
lexfile: noun.person
part of speech: noun
instance hypernym: 10050002-n