Diane de Poitiers-n
type: LexicalEntry
canonical form: Diane de Poitiers
sense: 10953680-n
part of speech: noun

Duchesse de Valentinois-n
type: LexicalEntry
canonical form: Duchesse de Valentinois
sense: 10953680-n
part of speech: noun

10953680-n
type: LexicalConcept
in scheme: en-word.net
definition: French noblewoman who was the mistress of Henry II; she had more influence over him than did his wife Catherine de Medicis (1499-1566)
ili: i94916
lexfile: noun.person
part of speech: noun
instance hypernym: 10103592-n