Astor-n
type: LexicalEntry
canonical form: Astor
sense: 10846161-n
part of speech: noun

John Jacob Astor-n
type: LexicalEntry
canonical form: John Jacob Astor
sense: 10846161-n
part of speech: noun

10846161-n
type: LexicalConcept
in scheme: en-word.net
definition: United States capitalist (born in Germany) who made a fortune in fur trading (1763-1848)
ili: i94342
lexfile: noun.person
part of speech: noun
instance hypernym: 09632262-n