Asimov-n
type: LexicalEntry
canonical form: Asimov
sense: 10845808-n
part of speech: noun

Isaac Asimov-n
type: LexicalEntry
canonical form: Isaac Asimov
sense: 10845808-n
part of speech: noun

10845808-n
type: LexicalConcept
in scheme: en-word.net
definition: United States writer (born in Russia) noted for his science fiction (1920-1992)
ili: i94340
lexfile: noun.person
part of speech: noun
instance hypernym: 10813654-n