Franciscan-n
type: LexicalEntry
canonical form: Franciscan
sense: 10798221-n
part of speech: noun

Grey Friar-n
type: LexicalEntry
canonical form: Grey Friar
sense: 10798221-n
part of speech: noun

10798221-n
type: LexicalConcept
in scheme: en-word.net
definition: a Roman Catholic friar wearing the grey habit of the Franciscan order
ili: i94108
lexfile: noun.person
part of speech: noun
hypernym: 10131672-n