utterer-n
type: LexicalEntry
canonical form: utterer
sense: 10763200-n
part of speech: noun

10763200-n
type: LexicalConcept
in scheme: en-word.net
definition: someone who circulates forged banknotes or counterfeit coins
ili: i93873
lexfile: noun.person
part of speech: noun
exemplifies: 06730109-n
hypernym: 10017621-n