translator-n
type: LexicalEntry
canonical form: translator
sense: 10744916-n
part of speech: noun

transcriber-n
type: LexicalEntry
canonical form: transcriber
sense: 10744916-n
part of speech: noun

10744916-n
type: LexicalConcept
in scheme: en-word.net
definition: a person who translates written messages from one language to another
ili: i93750
lexfile: noun.person
part of speech: noun
hypernym: 10283916-n