transfer-n
type: LexicalEntry
canonical form: transfer
sense: 10744008-n
part of speech: noun

transferee-n
type: LexicalEntry
canonical form: transferee
sense: 10744008-n
part of speech: noun

10744008-n
type: LexicalConcept
in scheme: en-word.net
definition: someone who transfers or is transferred from one position to another
example: the best student was a transfer from LSU
ili: i93745
lexfile: noun.person
part of speech: noun
hypernym: 09786620-n