transcriber-n
type: LexicalEntry
canonical form: transcriber
sense: 10743620-n
part of speech: noun

10743620-n
type: LexicalConcept
in scheme: en-word.net
definition: someone who makes a written version of spoken material
ili: i93742
lexfile: noun.person
part of speech: noun
hypernym: 10820913-n